Target
Replicase polyprotein 1ab
Ligand
BDBM429464
Substrate
Meas. Tech.
SARS-CoV-1 and -2 3CLpro Biochemical Assay
IC50
930±50 nM
Citation
 Han, SHGoins, CMArya, TShin, WJMaw, JHooper, ASonawane, DPPorter, MRBannister, BECrouch, RDLindsey, AALakatos, GMartinez, SRAlvarado, JAkers, WSWang, NSJung, JUMacdonald, JDStauffer, SR Structure-Based Optimization of ML300-Derived, Noncovalent Inhibitors Targeting the Severe Acute Respiratory Syndrome Coronavirus 3CL Protease (SARS-CoV-2 3CL J Med Chem 65:2880-2904 (2021)  
Target
Name:
Replicase polyprotein 1ab
Synonyms:
3C-like proteinase 3C-like proteinase (SARS-CoV 3Cpro) 3CLp GFL Guanine-N7 methyltransferase Helicase Leader protein Non-structural protein 10 Non-structural protein 3 Non-structural protein 6 Non-structural protein 8 ORF1ab polyprotein PL2-PRO Pol R1AB_SARS RdRp SARS coronavirus main proteinase nsp1 nsp12 nsp14 nsp16 nsp3 nsp5 nsp7 nsp9 pp1ab | rep
Type:
Protein
Mol. Mass.:
790250.81
Organism:
Human SARS coronavirus (SARS-CoV) (Severe acute respiratory syndrome coronavirus)
Description:
P0C6X7
Residue:
7073
  
Inhibitor
Name:
BDBM429464
Synonyms:
ML300-based SC inhibitor 8 med.21724, Compound 136
Type:
Small Organic Molecule
Emp. Form.:
C24H19N5OS
Mol. Mass.:
425.506
SMILES:
O=C(Cn1nnc2ccccc12)N(Cc1ccsc1)c1ccc(cc1)-c1cccnc1
: