Target
Replicase polyprotein 1ab
Ligand
BDBM479484
Substrate
Meas. Tech.
SARS-CoV-1 and -2 3CLpro Biochemical Assay
IC50
2510±440 nM
Citation
 Han, SHGoins, CMArya, TShin, WJMaw, JHooper, ASonawane, DPPorter, MRBannister, BECrouch, RDLindsey, AALakatos, GMartinez, SRAlvarado, JAkers, WSWang, NSJung, JUMacdonald, JDStauffer, SR Structure-Based Optimization of ML300-Derived, Noncovalent Inhibitors Targeting the Severe Acute Respiratory Syndrome Coronavirus 3CL Protease (SARS-CoV-2 3CL J Med Chem 65:2880-2904 (2021)  
Target
Name:
Replicase polyprotein 1ab
Synonyms:
ORF1ab polyprotein pp1ab | rep
Type:
Protein
Mol. Mass.:
794070.71
Organism:
2019-nCoV
Description:
P0DTD1
Residue:
7096
  
Inhibitor
Name:
BDBM479484
Synonyms:
ML300-based SC inhibitor 23
Type:
Small Organic Molecule
Emp. Form.:
C23H21N5O
Mol. Mass.:
383.4457
SMILES:
O=C(Cn1nnc2ccccc12)N(CC1CC1)c1ccc(cc1)-c1cccnc1
: