Target
Programmed cell death protein 1
Ligand
BDBM482358
Substrate
Meas. Tech.
Enzyme-Linked Immunosorbent Assay ELISA
IC50
<5±n/a nM
Citation
 Lange, CMalathong, VMali, VRMcMahon, JMcMurtrie, DJPunna, SRoth, HSSingh, RWang, YYang, JZhang, P Immunomodulator compounds US Patent  US10919852 Publication Date 2/16/2021 
Target
Name:
Programmed cell death protein 1
Synonyms:
CD_antigen=CD279 PDCD1 Programmed cell death protein 1 hPD-1
Type:
PROTEIN
Mol. Mass.:
31650.07
Organism:
Homo sapiens
Description:
ChEMBL_108437
Residue:
288
  
Inhibitor
Name:
BDBM482358
Synonyms:
US10919852, Compound TABLE 1.57 | US11708326, Compound TABLE 1.57
Type:
Small organic molecule
Emp. Form.:
C36H47ClN2O6
Mol. Mass.:
639.221
SMILES:
CCOc1cc(O[C@H]2CCc3c2cccc3-c2cccc(OCCCN3CC[C@@H](O)C3)c2C)c(Cl)cc1CNC(C)(CO)CO
: