Target
Programmed cell death protein 1
Ligand
BDBM482372
Substrate
Meas. Tech.
Enzyme-Linked Immunosorbent Assay ELISA
IC50
<5±n/a nM
Citation
 Lange, CMalathong, VMali, VRMcMahon, JMcMurtrie, DJPunna, SRoth, HSSingh, RWang, YYang, JZhang, P Immunomodulator compounds US Patent  US10919852 Publication Date 2/16/2021 
Target
Name:
Programmed cell death protein 1
Synonyms:
CD_antigen=CD279 PDCD1 Programmed cell death protein 1 hPD-1
Type:
PROTEIN
Mol. Mass.:
31650.07
Organism:
Homo sapiens
Description:
ChEMBL_108437
Residue:
288
  
Inhibitor
Name:
BDBM482372
Synonyms:
US10919852, Compound TABLE 1.71 | US11708326, Compound TABLE 1.71
Type:
Small organic molecule
Emp. Form.:
C43H47ClN4O9
Mol. Mass.:
799.308
SMILES:
COC(=O)C1(O)CCN(CCCOc2cccc(c2C)-c2cccc3[C@H](CCc23)Oc2cc(OCc3cncc(c3)C#N)c(CN[C@@H]([C@@H](C)O)C(O)=O)cc2Cl)C1
: