Target
Programmed cell death protein 1
Ligand
BDBM482374
Substrate
Meas. Tech.
Enzyme-Linked Immunosorbent Assay ELISA
IC50
<5±n/a nM
Citation
 Lange, CMalathong, VMali, VRMcMahon, JMcMurtrie, DJPunna, SRoth, HSSingh, RWang, YYang, JZhang, P Immunomodulator compounds US Patent  US10919852 Publication Date 2/16/2021 
Target
Name:
Programmed cell death protein 1
Synonyms:
CD_antigen=CD279 PDCD1 Programmed cell death protein 1 hPD-1
Type:
PROTEIN
Mol. Mass.:
31650.07
Organism:
Homo sapiens
Description:
ChEMBL_108437
Residue:
288
  
Inhibitor
Name:
BDBM482374
Synonyms:
US10919852, Compound TABLE 1.73 | US11708326, Compound TABLE 1.73
Type:
Small organic molecule
Emp. Form.:
C45H50ClN5O5
Mol. Mass.:
776.362
SMILES:
Cc1c(OCCCN2C3CCC2CC(O)C3)cccc1-c1cccc2[C@H](CCc12)Oc1cc(OCc2cncc(c2)C#N)c(CNCC2CCC(=O)N2)cc1Cl
: