Target
Programmed cell death protein 1
Ligand
BDBM482386
Substrate
Meas. Tech.
Enzyme-Linked Immunosorbent Assay ELISA
IC50
<5±n/a nM
Citation
 Lange, CMalathong, VMali, VRMcMahon, JMcMurtrie, DJPunna, SRoth, HSSingh, RWang, YYang, JZhang, P Immunomodulator compounds US Patent  US10919852 Publication Date 2/16/2021 
Target
Name:
Programmed cell death protein 1
Synonyms:
CD_antigen=CD279 PDCD1 Programmed cell death protein 1 hPD-1
Type:
PROTEIN
Mol. Mass.:
31650.07
Organism:
Homo sapiens
Description:
ChEMBL_108437
Residue:
288
  
Inhibitor
Name:
BDBM482386
Synonyms:
US10919852, Compound TABLE 1.85 | US11708326, Compound TABLE 1.85
Type:
Small organic molecule
Emp. Form.:
C43H48ClFN4O4
Mol. Mass.:
739.317
SMILES:
Cc1c(OCCCN2CC[C@H](F)C2)cccc1-c1cccc2[C@H](CCc12)Oc1cc(OCc2cncc(c2)C#N)c(CN[C@@H]2CCCC[C@@H]2O)cc1Cl
: