Target
Programmed cell death protein 1
Ligand
BDBM482391
Substrate
Meas. Tech.
Enzyme-Linked Immunosorbent Assay ELISA
IC50
<5±n/a nM
Citation
 Lange, CMalathong, VMali, VRMcMahon, JMcMurtrie, DJPunna, SRoth, HSSingh, RWang, YYang, JZhang, P Immunomodulator compounds US Patent  US10919852 Publication Date 2/16/2021 
Target
Name:
Programmed cell death protein 1
Synonyms:
CD_antigen=CD279 PDCD1 Programmed cell death protein 1 hPD-1
Type:
PROTEIN
Mol. Mass.:
31650.07
Organism:
Homo sapiens
Description:
ChEMBL_108437
Residue:
288
  
Inhibitor
Name:
BDBM482391
Synonyms:
US10919852, Compound TABLE 1.90 | US11708326, Compound TABLE 1.90
Type:
Small organic molecule
Emp. Form.:
C44H47Cl2FN4O4
Mol. Mass.:
785.773
SMILES:
O[C@H]1CCCC[C@H]1NCc1cc(Cl)c(O[C@H]2CCc3c2cccc3-c2cccc(OCCCN3CC4(CC(F)C4)C3)c2Cl)cc1OCc1cncc(c1)C#N
: