Target
Programmed cell death protein 1
Ligand
BDBM482463
Substrate
Meas. Tech.
Enzyme-Linked Immunosorbent Assay ELISA
IC50
<5±n/a nM
Citation
 Lange, CMalathong, VMali, VRMcMahon, JMcMurtrie, DJPunna, SRoth, HSSingh, RWang, YYang, JZhang, P Immunomodulator compounds US Patent  US10919852 Publication Date 2/16/2021 
Target
Name:
Programmed cell death protein 1
Synonyms:
CD_antigen=CD279 PDCD1 Programmed cell death protein 1 hPD-1
Type:
PROTEIN
Mol. Mass.:
31650.07
Organism:
Homo sapiens
Description:
ChEMBL_108437
Residue:
288
  
Inhibitor
Name:
BDBM482463
Synonyms:
US10919852, Compound TABLE 1.162 | US11708326, Compound TABLE 1.162
Type:
Small organic molecule
Emp. Form.:
C41H43Cl2FN4O4
Mol. Mass.:
745.709
SMILES:
CC1(O)CN(Cc2cc(Cl)c(O[C@H]3CCc4c3cccc4-c3cccc(OCCCN4CCC(F)CC4)c3Cl)cc2OCc2cncc(c2)C#N)C1
: