Target
Neuraminidase [H274Y]
Ligand
BDBM482720
Substrate
Meas. Tech.
Activity assay for influenza virus neuraminidase
IC50
5.5±n/a nM
Citation
 Zhang, JWang, KLiu, YLi, D Cyclohexene compounds and use thereof US Patent  US10919856 Publication Date 2/16/2021 
Target
Name:
Neuraminidase [H274Y]
Synonyms:
NA Neuraminidase A (H274Y)
Type:
Enzyme Catalytic Domain
Mol. Mass.:
52157.78
Organism:
Influenza A virus (A/Tokyo/3/67(H2N2))
Description:
P06820[H274Y]
Residue:
469
  
Inhibitor
Name:
BDBM482720
Synonyms:
US10919856, Example 5
Type:
Small organic molecule
Emp. Form.:
C20H33N3O5
Mol. Mass.:
395.4931
SMILES:
CC(=O)N[C@@H]1[C@@H](N)CC(OC=O)=C[C@H]1N1CCC[C@H](C1)OCCOCC1CC1
: