Target
Neuraminidase [H274Y]
Ligand
BDBM482731
Substrate
Meas. Tech.
Activity assay for influenza virus neuraminidase
IC50
5.5±n/a nM
Citation
 Zhang, JWang, KLiu, YLi, D Cyclohexene compounds and use thereof US Patent  US10919856 Publication Date 2/16/2021 
Target
Name:
Neuraminidase [H274Y]
Synonyms:
NA Neuraminidase A (H274Y)
Type:
Enzyme Catalytic Domain
Mol. Mass.:
52157.78
Organism:
Influenza A virus (A/Tokyo/3/67(H2N2))
Description:
P06820[H274Y]
Residue:
469
  
Inhibitor
Name:
BDBM482731
Synonyms:
US10919856, CONTRAST EXAMPLE 1
Type:
Small organic molecule
Emp. Form.:
C17H29N3O4
Mol. Mass.:
339.4299
SMILES:
CCOC[C@@H]1CCCN(C1)[C@@H]1C=C(C[C@H](N)[C@H]1NC(C)=O)OC=O
: