Target
Neuraminidase [H274Y]
Ligand
BDBM482733
Substrate
Meas. Tech.
Activity assay for influenza virus neuraminidase
IC50
5.5±n/a nM
Citation
 Zhang, JWang, KLiu, YLi, D Cyclohexene compounds and use thereof US Patent  US10919856 Publication Date 2/16/2021 
Target
Name:
Neuraminidase [H274Y]
Synonyms:
NA Neuraminidase A (H274Y)
Type:
Enzyme Catalytic Domain
Mol. Mass.:
52157.78
Organism:
Influenza A virus (A/Tokyo/3/67(H2N2))
Description:
P06820[H274Y]
Residue:
469
  
Inhibitor
Name:
BDBM482733
Synonyms:
US10919856, CONTRAST EXAMPLE 3
Type:
Small organic molecule
Emp. Form.:
C17H26F3N3O4
Mol. Mass.:
393.4012
SMILES:
CC(=O)N[C@@H]1[C@@H](N)CC(OC=O)=C[C@H]1N1CCC[C@@H](COCC(F)(F)F)C1
: