Target
Endothelin-1
Ligand
BDBM171385
Substrate
Meas. Tech.
ET-1 Assay
EC50
>200000±n/a nM
Citation
 PubChem, PCBuckman, BONicholas, JBRamphal, JYEmayan, KSeiwert, SD Anti-fibrotic pyridinones US Patent  US9675593 Publication Date 6/13/2017 
Target
Name:
Endothelin-1
Synonyms:
EDN1 PPET1 | Preproendothelin-1
Type:
Protein
Mol. Mass.:
24444.51
Organism:
Homo sapiens (Human)
Description:
P05305
Residue:
212
  
Inhibitor
Name:
BDBM171385
Synonyms:
US9675593, 371
Type:
Small organic molecule
Emp. Form.:
C14H10ClN3O
Mol. Mass.:
271.702
SMILES:
Clc1ccc(cc1)-n1cc(ccc1=O)-c1cn[nH]c1
: