Target
Endothelin-1
Ligand
BDBM172784
Substrate
Meas. Tech.
ET-1 Assay
EC50
<50000±n/a nM
Citation
 PubChem, PCBuckman, BONicholas, JBRamphal, JYEmayan, KSeiwert, SD Anti-fibrotic pyridinones US Patent  US9675593 Publication Date 6/13/2017 
Target
Name:
Endothelin-1
Synonyms:
EDN1 PPET1 | Preproendothelin-1
Type:
Protein
Mol. Mass.:
24444.51
Organism:
Homo sapiens (Human)
Description:
P05305
Residue:
212
  
Inhibitor
Name:
BDBM172784
Synonyms:
US9675593, 685
Type:
Small organic molecule
Emp. Form.:
C20H20N6O2
Mol. Mass.:
376.4118
SMILES:
CCOc1ccc(c(C)c1)-n1cc(-c2ccnnc2)c2nn(CC)nc2c1=O
: