Target
Solute carrier family 22 member 12
Ligand
BDBM377564
Substrate
Meas. Tech.
URAT1-Model Assay
EC50
275±n/a nM
Citation
 Ouk, SGunic, EVernier, JChen, C Thioacetate compounds, compositions and methods of use US Patent  US10919858 Publication Date 2/16/2021 
Target
Name:
Solute carrier family 22 member 12
Synonyms:
OATL4 RST S22AC_HUMAN Solute carrier family 22 member 12 URAT1 Urate anion exchanger 1 (URAT1) | Uric Acid Transporter 1 (URAT1)
Type:
Enzyme
Mol. Mass.:
59638.65
Organism:
Homo sapiens (Human)
Description:
Q96S37
Residue:
553
  
Inhibitor
Name:
BDBM377564
Synonyms:
US10266493, Example 2DDD | US10919858, Example 2DDD
Type:
Small organic molecule
Emp. Form.:
C17H18N2O3S
Mol. Mass.:
330.401
SMILES:
CC(=O)Nc1ccc(cc1)-c1cnccc1SC(C)(C)C(O)=O
: