Target
Proto-oncogene tyrosine-protein kinase Src
Ligand
BDBM340152
Substrate
Meas. Tech.
Enzyme Activity Assay
EC50
>1000±n/a nM
Citation
 Barf, TAJans, CGde Man, APOubrie, AARaaijmakers, HCRewinkel, JBSterrenburg, JGWijkmans, JC 4-imidazopyridazin-1-yl-benzamides as Btk inhibitors US Patent  US10934296 Publication Date 3/2/2021 
Target
Name:
Proto-oncogene tyrosine-protein kinase Src
Synonyms:
Calmodulin/Proto-oncogene tyrosine-protein kinase Src Proto-oncogene c-Src SRC SRC_HUMAN V-src sarcoma (Schmidt-Ruppin A-2) viral oncogene homolog (avian) p60-Src | pp60c-src
Type:
Protein
Mol. Mass.:
59838.60
Organism:
Homo sapiens (Human)
Description:
P12931
Residue:
536
  
Inhibitor
Name:
BDBM340152
Synonyms:
(S)-4-(3-(1-acryloylpyrrolidin-2-yl)- 8-aminoimidazo[1,5-a]pyrazin-1-yl)- N-(4-(pyrrolidin-1-yl)pyridin-2- yl)benzamide US10934296, Example 43 | US9758524, Example 43
Type:
Small organic molecule
Emp. Form.:
C29H30N8O2
Mol. Mass.:
522.6009
SMILES:
Nc1nccn2c(nc(-c3ccc(cc3)C(=O)Nc3cc(ccn3)N3CCCC3)c12)[C@@H]1CCCN1C(=O)C=C
: