Target
Fibroblast growth factor receptor 2
Ligand
BDBM301296
Substrate
IC50
<100±n/a nM
Citation
 Wu, LZhang, CHe, CLu, LYao, W Substituted tricyclic compounds as FGFR inhibitors US Patent  US10131667 Publication Date 11/20/2018 
Target
Name:
Fibroblast growth factor receptor 2
Synonyms:
BEK FGFR-2 FGFR2 Fibroblast growth factor receptor 2 (FGFR2) KGFR Keratinocyte growth factor receptor VEGF-receptor 2 and Fibroblast growth factor receptor 2
Type:
Enzyme
Mol. Mass.:
92015.45
Organism:
Homo sapiens (Human)
Description:
P21802
Residue:
821
  
Inhibitor
Name:
BDBM301296
Synonyms:
3-(2,6-difluoro-3,5-dimethoxyphenyl)-8-[(4,4-difluoropiperidin-1-yl)methyl]-1-methyl-1,3,4,7-tetrahydro-2H-pyrrolo[3',2':5,6]pyrido[4,3-d]pyrimidin-2-one US11053246, Example 112 | US9611267, Example 112
Type:
Small organic molecule
Emp. Form.:
C24H25F4N5O3
Mol. Mass.:
507.4806
SMILES:
COc1cc(OC)c(F)c(N2Cc3cnc4[nH]c(CN5CCC(F)(F)CC5)cc4c3N(C)C2=O)c1F
: