Target
Mitogen-activated protein kinase 14
Ligand
BDBM298446
Substrate
Meas. Tech.
Enzyme Inhibition
Kd
1.90±n/a nM
Citation
 Baker, TMFyfe, MCJones, GThom, SM Kinase inhibitors US Patent  US10941115 Publication Date 3/9/2021 
Target
Name:
Mitogen-activated protein kinase 14
Synonyms:
CSAID-binding protein CSBP1 CSPB1 MAP kinase 14 MAP kinase p38 alpha MAPK14 MK14_HUMAN Mitogen-activated protein kinase p38 alpha Stress-activated protein kinase 2a | p38 MAP kinase alpha/beta
Type:
Serine/threonine-protein kinase
Mol. Mass.:
41286.76
Organism:
Homo sapiens (Human)
Description:
Q16539
Residue:
360
  
Inhibitor
Name:
BDBM298446
Synonyms:
(4-((4-((4-(3-(5-(tert-Butyl)-2-methoxy-3-(methylsulfonamido)phenyl)ureido)naphthalen-1-yl)oxy)pyridin-2-yl)amino)-2-methoxyphenyl)(methyl)phosphinic acid US10392346, Example 44 US9751837, Example 44
Type:
Small organic molecule
Emp. Form.:
C36H40N5O8PS
Mol. Mass.:
733.77
SMILES:
COc1cc(Nc2cc(Oc3ccc(NC(=O)Nc4cc(cc(NS(C)(=O)=O)c4OC)C(C)(C)C)c4ccccc34)ccn2)ccc1P(C)(O)=O
: