Target
Tyrosine-protein kinase JAK2
Ligand
BDBM473567
Substrate
Meas. Tech.
Biochemical JAK Kinase Assays
Ki
0.025±n/a nM
Citation
 Long, DDSmith, CThompson, C Dimethyl amino azetidine amides as JAK inhibitors US Patent  US10947229 Publication Date 3/16/2021 
Target
Name:
Tyrosine-protein kinase JAK2
Synonyms:
JAK-2 JAK2_HUMAN Janus kinase 2 (JAK2) | Janus kinase 2 (a protein tyrosine kinase)
Type:
Protein
Mol. Mass.:
130684.68
Organism:
Homo sapiens (Human)
Description:
O60674
Residue:
1132
  
Inhibitor
Name:
BDBM473567
Synonyms:
US10844057, Example 10 US11634419, Example 3
Type:
Small organic molecule
Emp. Form.:
C30H37N7O2
Mol. Mass.:
527.6605
SMILES:
CCN1Cc2[nH]c(nc2C[C@H]1C(=O)N1CC(C)(C1)N(C)C)-c1n[nH]c2cc(ccc12)-c1ccc(O)cc1CC
: