Target
Non-receptor tyrosine-protein kinase TYK2
Ligand
BDBM277493
Substrate
Meas. Tech.
Biochemical JAK Assays
Ki
0.55±n/a nM
Citation
 Hudson, RKozak, JPodesto, DDHuang, XThalladi, VR Methods for treating ulcerative colitis using 3-((1R,3s,5S)-3-((7-((5-methyl-1H-pyrazol-3-yl)amino)-1,6-naphthyridin-5-yl)amino)-8-azabicyclo[3.2.1]octan-8-yl)propanenitrile US Patent  US10947254 Publication Date 3/16/2021 
Target
Name:
Non-receptor tyrosine-protein kinase TYK2
Synonyms:
Non-receptor tyrosine-protein kinase TYK2 (TYK2) TYK2_HUMAN | Tyrosine-protein kinase TYK2
Type:
Protein
Mol. Mass.:
133666.03
Organism:
Homo sapiens (Human)
Description:
P29597
Residue:
1187
  
Inhibitor
Name:
BDBM277493
Synonyms:
US10072026, Example 2-29 | US10947254, Example 2-29
Type:
Small organic molecule
Emp. Form.:
C25H30N8O
Mol. Mass.:
458.5587
SMILES:
CC(CC#N)C(=O)N1[C@H]2CCC[C@@H]1C[C@H](C2)Nc1nc(Nc2cc(C)[nH]n2)cc2ncccc12
: