Target
Mucosa-associated lymphoid tissue lymphoma translocation protein 1
Ligand
BDBM487696
Substrate
Meas. Tech.
In Vitro Assay
IC50
15.0±n/a nM
Citation
 Lu, TAllison, BDBarbay, JKConnolly, PJCummings, MDDiels, GEdwards, JPKreutter, KDPhilippar, UShen, FThuring, JWWu, TBerthelot, DJ Pyrazole derivatives as MALT1 inhibitors US Patent  US10954214 Publication Date 3/23/2021 
Target
Name:
Mucosa-associated lymphoid tissue lymphoma translocation protein 1
Synonyms:
MALT lymphoma-associated translocation MALT1 MLT Paracaspase
Type:
Enzyme
Mol. Mass.:
92257.81
Organism:
Homo sapiens (Human)
Description:
Q9UDY8
Residue:
824
  
Inhibitor
Name:
BDBM487696
Synonyms:
N-(5-cyano-6-(2H-1,2,3-triazol- 2-yl)pyridin-3-yl)-1-(8- fluoroisoquinolin-4-yl)-5- (trifluoromethyl)-1H-pyrazole-4- carboxamide | US10954214, Compound 118
Type:
Small organic molecule
Emp. Form.:
C22H11F4N9O
Mol. Mass.:
493.3761
SMILES:
Fc1cccc2c(cncc12)-n1ncc(C(=O)Nc2cnc(c(c2)C#N)-n2nccn2)c1C(F)(F)F
: