Target
Mucosa-associated lymphoid tissue lymphoma translocation protein 1
Ligand
BDBM487697
Substrate
Meas. Tech.
In Vitro Assay
IC50
13.0±n/a nM
Citation
 Lu, TAllison, BDBarbay, JKConnolly, PJCummings, MDDiels, GEdwards, JPKreutter, KDPhilippar, UShen, FThuring, JWWu, TBerthelot, DJ Pyrazole derivatives as MALT1 inhibitors US Patent  US10954214 Publication Date 3/23/2021 
Target
Name:
Mucosa-associated lymphoid tissue lymphoma translocation protein 1
Synonyms:
MALT lymphoma-associated translocation MALT1 MLT Paracaspase
Type:
Enzyme
Mol. Mass.:
92257.81
Organism:
Homo sapiens (Human)
Description:
Q9UDY8
Residue:
824
  
Inhibitor
Name:
BDBM487697
Synonyms:
1-(benzo[d][1,2,3]thiadiazol-7- yl)-N-(5-cyano-6-(2H-1,2,3- triazol-2-yl)pyridin-3-yl)-5- (trifluoromethyl)-1H-pyrazole-4- carboxamide | US10954214, Compound 119
Type:
Small organic molecule
Emp. Form.:
C19H9F3N10OS
Mol. Mass.:
482.401
SMILES:
FC(F)(F)c1c(cnn1-c1cccc2nnsc12)C(=O)Nc1cnc(c(c1)C#N)-n1nccn1
: