Target
Mucosa-associated lymphoid tissue lymphoma translocation protein 1
Ligand
BDBM487763
Substrate
Meas. Tech.
In Vitro Assay
IC50
18.0±n/a nM
Citation
 Lu, TAllison, BDBarbay, JKConnolly, PJCummings, MDDiels, GEdwards, JPKreutter, KDPhilippar, UShen, FThuring, JWWu, TBerthelot, DJ Pyrazole derivatives as MALT1 inhibitors US Patent  US10954214 Publication Date 3/23/2021 
Target
Name:
Mucosa-associated lymphoid tissue lymphoma translocation protein 1
Synonyms:
MALT lymphoma-associated translocation MALT1 MLT Paracaspase
Type:
Enzyme
Mol. Mass.:
92257.81
Organism:
Homo sapiens (Human)
Description:
Q9UDY8
Residue:
824
  
Inhibitor
Name:
BDBM487763
Synonyms:
N-(5-bromo-2-methyl-6-(2H- 1,2,3-triazol-2-yl)pyridin-3-yl)- 1-(1-oxo-1,2-dihydroisoquinolin- 5-yl)-5-(trifluoromethyl)-1H- pyrazole-4-carboxamide | US10954214, Compound 185
Type:
Small organic molecule
Emp. Form.:
C22H14BrF3N8O2
Mol. Mass.:
559.298
SMILES:
Cc1nc(c(Br)cc1NC(=O)c1cnn(c1C(F)(F)F)-c1cccc2c1cc[nH]c2=O)-n1nccn1
: