Target
Mucosa-associated lymphoid tissue lymphoma translocation protein 1
Ligand
BDBM487933
Substrate
Meas. Tech.
In Vitro Assay
IC50
10.00±n/a nM
Citation
 Lu, TAllison, BDBarbay, JKConnolly, PJCummings, MDDiels, GEdwards, JPKreutter, KDPhilippar, UShen, FThuring, JWWu, TBerthelot, DJ Pyrazole derivatives as MALT1 inhibitors US Patent  US10954214 Publication Date 3/23/2021 
Target
Name:
Mucosa-associated lymphoid tissue lymphoma translocation protein 1
Synonyms:
MALT lymphoma-associated translocation MALT1 MLT Paracaspase
Type:
Enzyme
Mol. Mass.:
92257.81
Organism:
Homo sapiens (Human)
Description:
Q9UDY8
Residue:
824
  
Inhibitor
Name:
BDBM487933
Synonyms:
US10954214, Compound 355 | methyl 3-chloro-5-(1-(1-oxo-1,2- dihydroisoquinolin-5-yl)-5- (trifluoromethyl)-1H-pyrazole-4- carboxamido)picolinate
Type:
Small organic molecule
Emp. Form.:
C21H13ClF3N5O4
Mol. Mass.:
491.807
SMILES:
COC(=O)c1ncc(NC(=O)c2cnn(c2C(F)(F)F)-c2cccc3c2cc[nH]c3=O)cc1Cl
: