Target
Mucosa-associated lymphoid tissue lymphoma translocation protein 1
Ligand
BDBM488006
Substrate
Meas. Tech.
In Vitro Assay
IC50
11.0±n/a nM
Citation
 Lu, TAllison, BDBarbay, JKConnolly, PJCummings, MDDiels, GEdwards, JPKreutter, KDPhilippar, UShen, FThuring, JWWu, TBerthelot, DJ Pyrazole derivatives as MALT1 inhibitors US Patent  US10954214 Publication Date 3/23/2021 
Target
Name:
Mucosa-associated lymphoid tissue lymphoma translocation protein 1
Synonyms:
MALT lymphoma-associated translocation MALT1 MLT Paracaspase
Type:
Enzyme
Mol. Mass.:
92257.81
Organism:
Homo sapiens (Human)
Description:
Q9UDY8
Residue:
824
  
Inhibitor
Name:
BDBM488006
Synonyms:
N-(5-cyano-6-methoxypyridin-3- yl)-1-(1-oxo-1,2- dihydroisoquinolin-5-yl)-5- (trifluoromethyl)-1H-pyrazole-4- carboxamide | US10954214, Compound 428
Type:
Small organic molecule
Emp. Form.:
C22H14F3N5O3
Mol. Mass.:
453.3735
SMILES:
COc1ncc(NC(=O)C2=C(C(N=C2)c2cccc3c2cc[nH]c3=O)C(F)(F)F)cc1C#N
: