Target
Tyrosine-protein kinase JAK3
Ligand
BDBM431909
Substrate
Meas. Tech.
Biochemical Kinase Assay
Ki
0.320±n/a nM
Citation
 Fatheree, PRBrandt, GESmith, CSullivan, SDVan Orden, LJ JAK inhibitors containing a 4-membered heterocyclic amide US Patent  US10954237 Publication Date 3/23/2021 
Target
Name:
Tyrosine-protein kinase JAK3
Synonyms:
JAK-3 JAK3_HUMAN Janus kinase 3 (JAK3) L-JAK | Leukocyte janus kinase
Type:
Protein
Mol. Mass.:
125111.08
Organism:
Homo sapiens (Human)
Description:
P52333
Residue:
1124
  
Inhibitor
Name:
BDBM431909
Synonyms:
US10550118, Example 8-16 US11453668, Example 8-16 | US11634419, Example C-4
Type:
Small organic molecule
Emp. Form.:
C31H38FN7O2
Mol. Mass.:
559.6775
SMILES:
CCc1cc(O)c(F)cc1-c1ccc2c(n[nH]c2c1)-c1nc2C[C@H](N(Cc2[nH]1)C(C)C)C(=O)N1CC(C)(C1)N(C)C
: