Target
Fatty acid-binding protein 5
Ligand
BDBM489698
Substrate
Meas. Tech.
High Throughput Fluorescence Displacement Assay
Ki
90.0±n/a nM
Citation
 Ojima, IDeutsch, DKaczocha, MHu, KTong, SElmes, MYan, S Alpha-truxillic acid derivatives and pharmaceutical compositions thereof US Patent  US10968163 Publication Date 4/6/2021 
Target
Name:
Fatty acid-binding protein 5
Synonyms:
FABP5 Fatty acid binding protein epidermal | Fatty acid-binding protein 5 (FABP5)
Type:
Enzyme
Mol. Mass.:
15164.79
Organism:
Homo sapiens (Human)
Description:
Q01469
Residue:
135
  
Inhibitor
Name:
BDBM489698
Synonyms:
US10968163, Compound 3 | US10968163, Compound 3-A
Type:
Small organic molecule
Emp. Form.:
C25H21O4
Mol. Mass.:
385.4324
SMILES:
[O-]C(=O)C1C(C(C1c1ccccc1)C(=O)OCc1ccccc1)c1ccccc1
: