Target
Fatty acid-binding protein 5
Ligand
BDBM50468438
Substrate
Meas. Tech.
High Throughput Fluorescence Displacement Assay
Ki
180±n/a nM
Citation
 Ojima, IDeutsch, DKaczocha, MHu, KTong, SElmes, MYan, S Alpha-truxillic acid derivatives and pharmaceutical compositions thereof US Patent  US10968163 Publication Date 4/6/2021 
Target
Name:
Fatty acid-binding protein 5
Synonyms:
FABP5 Fatty acid binding protein epidermal | Fatty acid-binding protein 5 (FABP5)
Type:
Enzyme
Mol. Mass.:
15164.79
Organism:
Homo sapiens (Human)
Description:
Q01469
Residue:
135
  
Inhibitor
Name:
BDBM50468438
Synonyms:
CHEMBL4282959 | US10968163, Compound 3c
Type:
Small organic molecule
Emp. Form.:
C25H21FO4
Mol. Mass.:
404.4302
SMILES:
OC(=O)[C@H]1[C@@H]([C@@H]([C@H]1c1ccccc1)C(=O)OCc1ccc(F)cc1)c1ccccc1
: