Target
Fatty acid-binding protein 5
Ligand
BDBM489713
Substrate
Meas. Tech.
High Throughput Fluorescence Displacement Assay
Ki
110±n/a nM
Citation
 Ojima, IDeutsch, DKaczocha, MHu, KTong, SElmes, MYan, S Alpha-truxillic acid derivatives and pharmaceutical compositions thereof US Patent  US10968163 Publication Date 4/6/2021 
Target
Name:
Fatty acid-binding protein 5
Synonyms:
FABP5 Fatty acid binding protein epidermal | Fatty acid-binding protein 5 (FABP5)
Type:
Enzyme
Mol. Mass.:
15164.79
Organism:
Homo sapiens (Human)
Description:
Q01469
Residue:
135
  
Inhibitor
Name:
BDBM489713
Synonyms:
US10968163, Compound 3k
Type:
Small organic molecule
Emp. Form.:
C24H17Cl3O4
Mol. Mass.:
475.748
SMILES:
OC(=O)[C@H]1[C@@H]([C@@H]([C@H]1c1ccccc1)C(=O)Oc1ccc(Cl)c(Cl)c1Cl)c1ccccc1
: