Target
Fatty acid-binding protein 5
Ligand
BDBM489714
Substrate
Meas. Tech.
High Throughput Fluorescence Displacement Assay
Ki
20.0±n/a nM
Citation
 Ojima, IDeutsch, DKaczocha, MHu, KTong, SElmes, MYan, S Alpha-truxillic acid derivatives and pharmaceutical compositions thereof US Patent  US10968163 Publication Date 4/6/2021 
Target
Name:
Fatty acid-binding protein 5
Synonyms:
FABP5 Fatty acid binding protein epidermal | Fatty acid-binding protein 5 (FABP5)
Type:
Enzyme
Mol. Mass.:
15164.79
Organism:
Homo sapiens (Human)
Description:
Q01469
Residue:
135
  
Inhibitor
Name:
BDBM489714
Synonyms:
US10968163, Compound 3l
Type:
Small organic molecule
Emp. Form.:
C30H29O4
Mol. Mass.:
453.5494
SMILES:
[O-]C(=O)C1C(C(C1c1ccccc1)C(=O)O[C@@H]1CCCC[C@H]1c1ccccc1)c1ccccc1
: