Target
Fatty acid-binding protein 5
Ligand
BDBM50468472
Substrate
Meas. Tech.
High Throughput Fluorescence Displacement Assay
Ki
150±n/a nM
Citation
 Ojima, IDeutsch, DKaczocha, MHu, KTong, SElmes, MYan, S Alpha-truxillic acid derivatives and pharmaceutical compositions thereof US Patent  US10968163 Publication Date 4/6/2021 
Target
Name:
Fatty acid-binding protein 5
Synonyms:
FABP5 Fatty acid binding protein epidermal | Fatty acid-binding protein 5 (FABP5)
Type:
Enzyme
Mol. Mass.:
15164.79
Organism:
Homo sapiens (Human)
Description:
Q01469
Residue:
135
  
Inhibitor
Name:
BDBM50468472
Synonyms:
CHEMBL4281708 | US10968163, Compound 3m
Type:
Small organic molecule
Emp. Form.:
C27H24O4
Mol. Mass.:
412.4771
SMILES:
OC(=O)[C@H]1[C@@H]([C@@H]([C@H]1c1ccccc1)C(=O)OC1Cc2ccccc2C1)c1ccccc1
: