Target
Fatty acid-binding protein 5
Ligand
BDBM489734
Substrate
Meas. Tech.
High Throughput Fluorescence Displacement Assay
Ki
330±n/a nM
Citation
 Ojima, IDeutsch, DKaczocha, MHu, KTong, SElmes, MYan, S Alpha-truxillic acid derivatives and pharmaceutical compositions thereof US Patent  US10968163 Publication Date 4/6/2021 
Target
Name:
Fatty acid-binding protein 5
Synonyms:
FABP5 Fatty acid binding protein epidermal | Fatty acid-binding protein 5 (FABP5)
Type:
Enzyme
Mol. Mass.:
15164.79
Organism:
Homo sapiens (Human)
Description:
Q01469
Residue:
135
  
Inhibitor
Name:
BDBM489734
Synonyms:
US10968163, Compound 4f
Type:
Small organic molecule
Emp. Form.:
C30H28Cl2O4
Mol. Mass.:
523.447
SMILES:
OC(=O)[C@H]1[C@@H]([C@@H]([C@H]1c1ccccc1Cl)C(=O)OC1CCCC[C@H]1c1ccccc1)c1ccccc1Cl
: