Target
Fatty acid-binding protein 5
Ligand
BDBM50468446
Substrate
Meas. Tech.
High Throughput Fluorescence Displacement Assay
Ki
50.0±n/a nM
Citation
 Ojima, IDeutsch, DKaczocha, MHu, KTong, SElmes, MYan, S Alpha-truxillic acid derivatives and pharmaceutical compositions thereof US Patent  US10968163 Publication Date 4/6/2021 
Target
Name:
Fatty acid-binding protein 5
Synonyms:
FABP5 Fatty acid binding protein epidermal | Fatty acid-binding protein 5 (FABP5)
Type:
Enzyme
Mol. Mass.:
15164.79
Organism:
Homo sapiens (Human)
Description:
Q01469
Residue:
135
  
Inhibitor
Name:
BDBM50468446
Synonyms:
CHEMBL4292323 | US10968163, Compound 4k
Type:
Small organic molecule
Emp. Form.:
C32H24Cl2O4
Mol. Mass.:
543.437
SMILES:
OC(=O)[C@H]1[C@@H]([C@@H]([C@H]1c1ccccc1Cl)C(=O)OCC1c2ccccc2-c2ccccc12)c1ccccc1Cl
: