Target
Stimulator of interferon genes protein
Ligand
BDBM490767
Substrate
Meas. Tech.
Radioligand Binding Assay
Ki
107±n/a nM
Citation
 Wythes, MJMcAlpine, IJPatman, RRui, EYMaderna, AJalaie, MGajiwala, KS Cyclopentane-based modulators of STING (stimulator of interferon genes) US Patent  US10968242 Publication Date 4/6/2021 
Target
Name:
Stimulator of interferon genes protein
Synonyms:
ERIS MITA STING STING_HUMAN TMEM173 hMITA | hSTING
Type:
Protein
Mol. Mass.:
42195.64
Organism:
Human
Description:
Q86WV6
Residue:
379
  
Inhibitor
Name:
BDBM490767
Synonyms:
US10968242, Example 1 Peak 3
Type:
Small organic molecule
Emp. Form.:
C20H23FN10O8P2S2
Mol. Mass.:
676.535
SMILES:
Nc1ncnc2n(cnc12)[C@@H]1C[C@@H]2OP(S)(=O)O[C@@H]3[C@@H](COP(S)(=O)O[C@@H]1[C@@H]2O)O[C@H]([C@H]3F)n1cnc2c(N)ncnc12
: