Target
Stimulator of interferon genes protein
Ligand
BDBM490777
Substrate
Meas. Tech.
Radioligand Binding Assay
Ki
0.200±n/a nM
Citation
 Wythes, MJMcAlpine, IJPatman, RRui, EYMaderna, AJalaie, MGajiwala, KS Cyclopentane-based modulators of STING (stimulator of interferon genes) US Patent  US10968242 Publication Date 4/6/2021 
Target
Name:
Stimulator of interferon genes protein
Synonyms:
ERIS MITA STING STING_HUMAN TMEM173 hMITA | hSTING
Type:
Protein
Mol. Mass.:
42195.64
Organism:
Human
Description:
Q86WV6
Residue:
379
  
Inhibitor
Name:
BDBM490777
Synonyms:
US10968242, Example 3 Peak 4
Type:
Small organic molecule
Emp. Form.:
C20H22FN9O9P2S2
Mol. Mass.:
677.52
SMILES:
Nc1ncnc2n(cnc12)[C@@H]1O[C@@H]2COP(S)(=O)O[C@@H]3[C@@H](O)[C@H](C[C@H]3n3cnc4c3nc[nH]c4=O)OP(S)(=O)O[C@H]2[C@@H]1F
: