Target
Stimulator of interferon genes protein
Ligand
BDBM490778
Substrate
Meas. Tech.
Radioligand Binding Assay
Ki
44.0±n/a nM
Citation
 Wythes, MJMcAlpine, IJPatman, RRui, EYMaderna, AJalaie, MGajiwala, KS Cyclopentane-based modulators of STING (stimulator of interferon genes) US Patent  US10968242 Publication Date 4/6/2021 
Target
Name:
Stimulator of interferon genes protein
Synonyms:
ERIS MITA STING STING_HUMAN TMEM173 hMITA | hSTING
Type:
Protein
Mol. Mass.:
42195.64
Organism:
Human
Description:
Q86WV6
Residue:
379
  
Inhibitor
Name:
BDBM490778
Synonyms:
US10968242, Example 7 Peak 1 | US10968242, Example 7 Peak 2
Type:
Small organic molecule
Emp. Form.:
C21H24FN9O9P2S2
Mol. Mass.:
691.546
SMILES:
Cc1nc2n(cnc2c(=O)[nH]1)[C@@H]1C[C@@H]2OP(S)(=O)O[C@@H]3[C@@H](COP(S)(=O)O[C@@H]1[C@@H]2O)O[C@H]([C@@H]3F)n1cnc2c(N)ncnc12
: