Target
Stimulator of interferon genes protein
Ligand
BDBM490790
Substrate
Meas. Tech.
Radioligand Binding Assay
Ki
0.300±n/a nM
Citation
 Wythes, MJMcAlpine, IJPatman, RRui, EYMaderna, AJalaie, MGajiwala, KS Cyclopentane-based modulators of STING (stimulator of interferon genes) US Patent  US10968242 Publication Date 4/6/2021 
Target
Name:
Stimulator of interferon genes protein
Synonyms:
ERIS MITA STING STING_HUMAN TMEM173 hMITA | hSTING
Type:
Protein
Mol. Mass.:
42195.64
Organism:
Human
Description:
Q86WV6
Residue:
379
  
Inhibitor
Name:
BDBM490790
Synonyms:
US10968242, Example 17 Peak 2
Type:
Small organic molecule
Emp. Form.:
C21H24FN9O8P2S3
Mol. Mass.:
707.612
SMILES:
Cn1cnc2n(cnc2c1=O)[C@@H]1C[C@@H]2OP(S)(=S)O[C@H]3[C@@H](F)[C@@H](O[C@@H]3COP(S)(=O)O[C@@H]1[C@H]2O)n1cnc2c(N)ncnc12
: