Target
Stimulator of interferon genes protein
Ligand
BDBM490791
Substrate
Meas. Tech.
Radioligand Binding Assay
Ki
0.190±n/a nM
Citation
 Wythes, MJMcAlpine, IJPatman, RRui, EYMaderna, AJalaie, MGajiwala, KS Cyclopentane-based modulators of STING (stimulator of interferon genes) US Patent  US10968242 Publication Date 4/6/2021 
Target
Name:
Stimulator of interferon genes protein
Synonyms:
ERIS MITA STING STING_HUMAN TMEM173 hMITA | hSTING
Type:
Protein
Mol. Mass.:
42195.64
Organism:
Human
Description:
Q86WV6
Residue:
379
  
Inhibitor
Name:
BDBM490791
Synonyms:
9-((4S,6R,7S,11aR,13R,14R,14aR,15R)-13-(6-amino-9H-purin-9-yl)-14-fluoro-15-hydroxy-2,9-dimercapto-2,9-disulfidooctahydro-11H-4,7-methanofuro[3,2-d][1,3,7,9]tetraoxa[2,8]diphosphacyclotridecin-6-yl)-1-methyl-1,9-dihydro-6H-purin-6-one (J-5) | US10968242, Example 18
Type:
Small organic molecule
Emp. Form.:
C21H24FN9O7P2S4
Mol. Mass.:
723.677
SMILES:
Cn1cnc2n(cnc2c1=O)[C@@H]1C[C@@H]2OP(S)(=S)O[C@H]3[C@@H](F)[C@@H](O[C@@H]3COP(S)(=S)O[C@@H]1[C@@H]2O)n1cnc2c(N)ncnc12
: