Target
Stimulator of interferon genes protein
Ligand
BDBM490796
Substrate
Meas. Tech.
Radioligand Binding Assay
Ki
294±n/a nM
Citation
 Wythes, MJMcAlpine, IJPatman, RRui, EYMaderna, AJalaie, MGajiwala, KS Cyclopentane-based modulators of STING (stimulator of interferon genes) US Patent  US10968242 Publication Date 4/6/2021 
Target
Name:
Stimulator of interferon genes protein
Synonyms:
ERIS MITA STING STING_HUMAN TMEM173 hMITA | hSTING
Type:
Protein
Mol. Mass.:
42195.64
Organism:
Human
Description:
Q86WV6
Residue:
379
  
Inhibitor
Name:
BDBM490796
Synonyms:
US10968242, Example 20 Peak 1
Type:
Small organic molecule
Emp. Form.:
C22H25FN8O11P2S
Mol. Mass.:
690.492
SMILES:
Cn1cnc2n(cnc2c1=O)[C@@H]1C[C@@H]2OP(O)(=O)O[C@@H]3[C@@H](COP(S)(=O)O[C@@H]1[C@@H]2O)O[C@H]([C@@H]3F)n1cnc2c1ncn(C)c2=O
: