Target
Leucyl-cystinyl aminopeptidase
Ligand
BDBM271199
Substrate
Meas. Tech.
Inhibition Activity Assay
IC50
1.50±n/a nM
Citation
 Kawaguchi, KIshihata, AInagaki, YTsuchiya, KHanadate, TKanai, AKaizawa, HKazami, JMorikawa, HHiramoto, MEnjo, KTakamatsu, H Pyridine derivative US Patent  US10975091 Publication Date 4/13/2021 
Target
Name:
Leucyl-cystinyl aminopeptidase
Synonyms:
Cystinyl aminopeptidase Insulin-regulated membrane aminopeptidase Irap Leucyl-cystinyl aminopeptidase Otase P-LAP Vesicle protein of 165 kDa | Vp165
Type:
PROTEIN
Mol. Mass.:
117179.39
Organism:
Rattus norvegicus
Description:
ChEMBL_98523
Residue:
1025
  
Inhibitor
Name:
BDBM271199
Synonyms:
US10059720, Example 14 | US10975091, Example 14
Type:
Small organic molecule
Emp. Form.:
C24H28N2O4
Mol. Mass.:
408.4901
SMILES:
CC(C)C[C@H](N)[C@](O)(Cc1cc(OCc2cccc3ccccc23)ccn1)C(O)=O
: