Target
Leucyl-cystinyl aminopeptidase
Ligand
BDBM271213
Substrate
Meas. Tech.
Inhibition Activity Assay
IC50
1.20±n/a nM
Citation
 Kawaguchi, KIshihata, AInagaki, YTsuchiya, KHanadate, TKanai, AKaizawa, HKazami, JMorikawa, HHiramoto, MEnjo, KTakamatsu, H Pyridine derivative US Patent  US10975091 Publication Date 4/13/2021 
Target
Name:
Leucyl-cystinyl aminopeptidase
Synonyms:
Cystinyl aminopeptidase Insulin-regulated membrane aminopeptidase Irap Leucyl-cystinyl aminopeptidase Otase P-LAP Vesicle protein of 165 kDa | Vp165
Type:
PROTEIN
Mol. Mass.:
117179.39
Organism:
Rattus norvegicus
Description:
ChEMBL_98523
Residue:
1025
  
Inhibitor
Name:
BDBM271213
Synonyms:
US10059720, Example 28 | US10975091, Example 28
Type:
Small organic molecule
Emp. Form.:
C19H30N2O4
Mol. Mass.:
350.4525
SMILES:
CC(C)C[C@H](N)[C@](O)(Cc1cc(OCCC2(C)CC2)ccn1)C(O)=O
: