Target
Leucyl-cystinyl aminopeptidase
Ligand
BDBM271275
Substrate
Meas. Tech.
Inhibition Activity Assay
IC50
1.000±n/a nM
Citation
 Kawaguchi, KIshihata, AInagaki, YTsuchiya, KHanadate, TKanai, AKaizawa, HKazami, JMorikawa, HHiramoto, MEnjo, KTakamatsu, H Pyridine derivative US Patent  US10975091 Publication Date 4/13/2021 
Target
Name:
Leucyl-cystinyl aminopeptidase
Synonyms:
Cystinyl aminopeptidase Insulin-regulated membrane aminopeptidase Irap Leucyl-cystinyl aminopeptidase Otase P-LAP Vesicle protein of 165 kDa | Vp165
Type:
PROTEIN
Mol. Mass.:
117179.39
Organism:
Rattus norvegicus
Description:
ChEMBL_98523
Residue:
1025
  
Inhibitor
Name:
BDBM271275
Synonyms:
US10059720, Example 90 | US10975091, Example 90
Type:
Small organic molecule
Emp. Form.:
C20H33N3O3
Mol. Mass.:
363.4943
SMILES:
CC(C)C[C@H](N)[C@](O)(Cc1cc(ccn1)N1CCC(C)(C)CC1)C(O)=O
: