Target
Interleukin-1 receptor-associated kinase 4
Ligand
BDBM494338
Substrate
Meas. Tech.
Biological Assay
Ki
1.30±n/a nM
Citation
 Bryan, MCGobbi, AKiefer, Jr., JRKolesnikov, AOlivero, AGDrobnick, JLiang, JRajapaksa, NNdubaku, CFeng, J Pyrazolo[1,5a]pyrimidine derivatives as IRAK4 modulators US Patent  US10988478 Publication Date 4/27/2021 
Target
Name:
Interleukin-1 receptor-associated kinase 4
Synonyms:
IRAK-4 IRAK4_HUMAN Interleukin-1 receptor-associated kinase 4 (IRAK4) | Renal carcinoma antigen NY-REN-64
Type:
Protein
Mol. Mass.:
51519.08
Organism:
Homo sapiens (Human)
Description:
Q9NWZ3
Residue:
460
  
Inhibitor
Name:
BDBM494338
Synonyms:
US10988478, Example 389
Type:
Small organic molecule
Emp. Form.:
C23H27FN6O2
Mol. Mass.:
438.4979
SMILES:
CC1(C)Cc2cc(NC(=O)c3cnn4cccnc34)c(cc2O1)N1CCC(F)(CN)CC1
: