Target
Complement factor D
Ligand
BDBM497357
Substrate
Meas. Tech.
Human Factor D Assay
IC50
<1000±n/a nM
Citation
 Wiles, JAPhadke, ASDeshpande, MAgarwal, AChen, DGadhachanda, VRHashimoto, APais, GWang, QWang, X Disubstituted compounds for treatment of medical disorders US Patent  US11001600 Publication Date 5/11/2021 
Target
Name:
Complement factor D
Synonyms:
Adipsin CFAD_HUMAN DF Properdin factor D
Type:
Protein
Mol. Mass.:
27039.19
Organism:
Homo sapiens (Human)
Description:
P00746
Residue:
253
  
Inhibitor
Name:
BDBM497357
Synonyms:
US11001600, Cmp No. 8 | diethyl (3-acetyl-1- (2-((2S,4R)-2-(2'- chloro-2- fluorobiphenyl-3- ylcarbamoyl)-4- fluoropyrrolidin-1- yl)-2-oxoethyl)-5-(2- methylpyrimidin-5- yl)-1H-indol-6- yloxy)methylphosphonate
Type:
Small organic molecule
Emp. Form.:
C39H39ClF2N5O7P
Mol. Mass.:
794.18
SMILES:
CCOP(=O)(COc1cc2n(CC(=O)N3C[C@H](F)C[C@H]3C(=O)Nc3cccc(c3F)-c3ccccc3Cl)cc(C(C)=O)c2cc1-c1cnc(C)nc1)OCC
: