Target
Complement factor D
Ligand
BDBM497377
Substrate
Meas. Tech.
Human Factor D Assay
IC50
<1000±n/a nM
Citation
 Wiles, JAPhadke, ASDeshpande, MAgarwal, AChen, DGadhachanda, VRHashimoto, APais, GWang, QWang, X Disubstituted compounds for treatment of medical disorders US Patent  US11001600 Publication Date 5/11/2021 
Target
Name:
Complement factor D
Synonyms:
Adipsin CFAD_HUMAN DF Properdin factor D
Type:
Protein
Mol. Mass.:
27039.19
Organism:
Homo sapiens (Human)
Description:
P00746
Residue:
253
  
Inhibitor
Name:
BDBM497377
Synonyms:
(3-acetyl-1-(2- ((2S,4R)-2-(6- bromopyridin-2- ylcarbamoyl)-4- fluoropyrrolidin-1- yl)-2-oxoethyl)-5-(2- methylpyrimidin-5- yl)-1H-indol-6- yloxy)methylphos- phonic acid | US11001600, Cmp No. 13
Type:
Small organic molecule
Emp. Form.:
C28H27BrFN6O7P
Mol. Mass.:
689.426
SMILES:
CC(=O)c1cn(CC(=O)N2C[C@H](F)C[C@H]2C(=O)Nc2cccc(Br)n2)c2cc(OCP(O)(O)=O)c(cc12)-c1cnc(C)nc1
: