Target
Complement factor D
Ligand
BDBM497378
Substrate
Meas. Tech.
Human Factor D Assay
IC50
<1000±n/a nM
Citation
 Wiles, JAPhadke, ASDeshpande, MAgarwal, AChen, DGadhachanda, VRHashimoto, APais, GWang, QWang, X Disubstituted compounds for treatment of medical disorders US Patent  US11001600 Publication Date 5/11/2021 
Target
Name:
Complement factor D
Synonyms:
Adipsin CFAD_HUMAN DF Properdin factor D
Type:
Protein
Mol. Mass.:
27039.19
Organism:
Homo sapiens (Human)
Description:
P00746
Residue:
253
  
Inhibitor
Name:
BDBM497378
Synonyms:
(2S,4R)-1-(2-(3- acetyl-6-(2- (dimethylamino)-2- oxoethoxy)-5-(2- methylpyrimidin-5- yl)-1H-indazol-1- yl)acetyl)-N-(6- bromopyridin-2- yl)-4- fluoropyrrolidine- 2-carboxamide | US11001600, Cmp No. 26
Type:
Small organic molecule
Emp. Form.:
C30H30BrFN8O5
Mol. Mass.:
681.512
SMILES:
CN(C)C(=O)COc1cc2n(CC(=O)N3C[C@H](F)C[C@H]3C(=O)Nc3cccc(Br)n3)nc(C(C)=O)c2cc1-c1cnc(C)nc1
: