Target
Nuclear receptor ROR-beta
Ligand
BDBM498077
Substrate
Meas. Tech.
Receptor Competition Binding Assay
Ki
>12500±n/a nM
Citation
 Clarke, CALugar, III, CWMorphy, JRRichardson, TIRudyk, HSapmaz, SStites, REVaught, GM Compounds useful for inhibiting RORγt US Patent  US11008336 Publication Date 5/18/2021 
Target
Name:
Nuclear receptor ROR-beta
Synonyms:
NR1F2 Nuclear receptor subfamily 1 group F member 2 RORB_HUMAN Retinoid-related orphan receptor-beta
Type:
PROTEIN
Mol. Mass.:
53227.30
Organism:
Homo sapiens (Human)
Description:
ChEMBL_107979
Residue:
470
  
Inhibitor
Name:
BDBM498077
Synonyms:
N-[4- (Ethylsulfonyl)benzyl]- 5'-methyl-1-{1-[6- (trifluoromethyl)pyridin- 3-yl]ethyl}-4',5'- dihydrospiro[piperidine- 4,7'-thieno[2,3- c]pyran]-2'- carboxamide isomer 2 | US11008336, Example 42
Type:
Small organic molecule
Emp. Form.:
C30H34F3N3O4S2
Mol. Mass.:
621.734
SMILES:
CCS(=O)(=O)c1ccc(CNC(=O)c2cc3CC(C)OC4(CCN(CC4)C(C)c4ccc(nc4)C(F)(F)F)c3s2)cc1
: