Target
Dual specificity calcium/calmodulin-dependent 3',5'-cyclic nucleotide phosphodiesterase 1C
Ligand
BDBM501512
Substrate
Meas. Tech.
Inhibition Assay
IC50
0.800±n/a nM
Citation
 Kehler, JJuhl, KMarigo, MVital, PJJessing, MLanggård, MRasmussen, LKClementson, CM 1H-pyrazolo[4,3-b]pyridines as PDE1 inhibitors US Patent  US11026923 Publication Date 6/8/2021 
Target
Name:
Dual specificity calcium/calmodulin-dependent 3',5'-cyclic nucleotide phosphodiesterase 1C
Synonyms:
3',5'-cyclic-AMP phosphodiesterase Calcium/calmodulin-dependent 3',5'-cyclic nucleotide phosphodiesterase 1C Hcam3 PDE1C_HUMAN Phosphodiesterase 1C | Phosphodiesterase, PDE1/PDE5
Type:
Enzyme
Mol. Mass.:
80778.58
Organism:
Homo sapiens (Human)
Description:
Q14123
Residue:
709
  
Inhibitor
Name:
BDBM501512
Synonyms:
1-isopropyl-3-methyl-N-[(1-methylimidazol-4- yl)methyl]-5-(2-propoxy-3- pyridyl)pyrazolo[4,3-b]pyridin-7-amine | US11026923, Example 142
Type:
Small organic molecule
Emp. Form.:
C24H31N7O
Mol. Mass.:
433.5492
SMILES:
CCCOc1ncccc1-c1cc(NCc2cn(C)cn2)c2n(nc(C)c2n1)C(C)CC
: