Target
Bromodomain-containing protein 2 [348-455]
Ligand
BDBM50452552
Substrate
Meas. Tech.
Isothermal Titration Calorimetry Analysis of Binding to Brd2-BD1 and Brd2-BD2
Kd
21±n/a nM
Citation
 Guy, RKSlavish, PJShadrick, WRYoung, BMBoyd, VABharatham, NPrice, JEShelat, A Tetrahydroquinoline-based bromodomain inhibitors US Patent  US11028051 Publication Date 6/8/2021 
Target
Name:
Bromodomain-containing protein 2 [348-455]
Synonyms:
BET bromodomain 2(2) (BRD2(2)) BRD2-BD2 Bromodomain-containing protein 2 (aa 348-455) RING3
Type:
Mol. Mass.:
12751.52
Organism:
Homo sapiens (Human)
Description:
P25440[348-455]
Residue:
108
  
Inhibitor
Name:
BDBM50452552
Synonyms:
CHEMBL4205876 | US11028051, Cmpd 52
Type:
Small organic molecule
Emp. Form.:
C20H24N2O3S
Mol. Mass.:
372.481
SMILES:
CC(C)OC(=O)N[C@@H]1C[C@H](C)N(C(C)=O)c2ccc(cc12)-c1cccs1
: