Target
Dihydroorotate dehydrogenase (quinone), mitochondrial
Ligand
BDBM501659
Substrate
Meas. Tech.
Inhibitory Enzyme Activity (In Vitro Assay)
IC50
5.5±n/a nM
Citation
 Thunuguntla, SSHosahalli, SPanigrahi, SKSchwarz, MArit, M 1, 4, 6-trisubstituted-2-alkyl-1H-benzo[d]imidazole derivatives as dihydroorotate oxygenase inhibitors US Patent  US11028054 Publication Date 6/8/2021 
Target
Name:
Dihydroorotate dehydrogenase (quinone), mitochondrial
Synonyms:
DHODH Dihydroorotate dehydrogenase Dihydroorotate dehydrogenase, mitochondrial Dihydroorotate oxidase (DHODH) | PYRD_HUMAN
Type:
Enzyme
Mol. Mass.:
42881.33
Organism:
Homo sapiens (Human)
Description:
Q02127
Residue:
395
  
Inhibitor
Name:
BDBM501659
Synonyms:
US11028054, Example 56
Type:
Small organic molecule
Emp. Form.:
C27H23F4N3O2
Mol. Mass.:
497.484
SMILES:
Cc1nc2c(cc(cc2[nH]1)-c1c(F)c(F)c(-c2cccc(CN3CCCCC3)c2)c(F)c1F)C(O)=O
: