Target
Dihydroorotate dehydrogenase (quinone), mitochondrial
Ligand
BDBM501671
Substrate
Meas. Tech.
Inhibitory Enzyme Activity (In Vitro Assay)
IC50
5.5±n/a nM
Citation
 Thunuguntla, SSHosahalli, SPanigrahi, SKSchwarz, MArit, M 1, 4, 6-trisubstituted-2-alkyl-1H-benzo[d]imidazole derivatives as dihydroorotate oxygenase inhibitors US Patent  US11028054 Publication Date 6/8/2021 
Target
Name:
Dihydroorotate dehydrogenase (quinone), mitochondrial
Synonyms:
DHODH Dihydroorotate dehydrogenase Dihydroorotate dehydrogenase, mitochondrial Dihydroorotate oxidase (DHODH) | PYRD_HUMAN
Type:
Enzyme
Mol. Mass.:
42881.33
Organism:
Homo sapiens (Human)
Description:
Q02127
Residue:
395
  
Inhibitor
Name:
BDBM501671
Synonyms:
US11028054, Example 111
Type:
Small organic molecule
Emp. Form.:
C21H19N3O2
Mol. Mass.:
345.3945
SMILES:
Cc1nc2c(cc(cc2[nH]1)-c1ccc(cc1)-n1c(C)ccc1C)C(O)=O
: